Target
Carbonic anhydrase 1
Ligand
BDBM25901
Substrate
Meas. Tech.
ChEMBL_675712 (CHEMBL1272346)
Kd
10000±n/a nM
Citation
 Capkauskaite, EBaranauskiene, LGolovenko, DManakova, EGražulis, STumkevičius, SMatulis, D Indapamide-like benzenesulfonamides as inhibitors of carbonic anhydrases I, II, VII, and XIII. Bioorg Med Chem 18:7357-64 (2010)  
Target
Name:
Carbonic anhydrase 1
Synonyms:
CA-I CAB Carbonate dehydratase I Carbonic anhydrase 1 (CA I) Carbonic anhydrase 1 (Recombinant CA I) Carbonic anhydrase B Carbonic anhydrase I (CA I) Carbonic anhydrase I (CAI) Carbonic anhydrase isoenzyme I (hCA I) | hCA
Type:
Enzyme
Mol. Mass.:
28873.37
Organism:
Homo sapiens (Human)
Description:
P00915
Residue:
261
  
Inhibitor
Name:
BDBM25901
Synonyms:
4-chloro-N-(2-methyl-2,3-dihydro-1H-indol-1-yl)-3-sulfamoylbenzamide Indapamide Lozol | Noranat
Type:
Small organic molecule
Emp. Form.:
C16H16ClN3O3S
Mol. Mass.:
365.835
SMILES:
CC1Cc2ccccc2N1NC(=O)c1ccc(Cl)c(c1)S(N)(=O)=O
: