Target
Carbonic anhydrase 2
Ligand
BDBM50329825
Substrate
Meas. Tech.
ChEMBL_675713 (CHEMBL1272347)
Kd
500±n/a nM
Citation
 Capkauskaite, EBaranauskiene, LGolovenko, DManakova, EGražulis, STumkevičius, SMatulis, D Indapamide-like benzenesulfonamides as inhibitors of carbonic anhydrases I, II, VII, and XIII. Bioorg Med Chem 18:7357-64 (2010)  
Target
Name:
Carbonic anhydrase 2
Synonyms:
CA-II CAC Carbonate dehydratase II Carbonic anhydrase 2 (CA-II) Carbonic anhydrase C Carbonic anhydrase II (CA-II) Carbonic anhydrase II (hCA II) | Carbonic anhydrase isoenzyme II (hCA II)
Type:
Enzyme
Mol. Mass.:
29250.71
Organism:
Homo sapiens (Human)
Description:
P00918
Residue:
260
  
Inhibitor
Name:
BDBM50329825
Synonyms:
5-[(2-Butyl-1H-benzimidazol-1-yl)acetyl]-2-chlorobenzenesulfonamide N-alkylated benzimidazole derivative, 4g
Type:
Small organic molecule
Emp. Form.:
C19H20ClN3O3S
Mol. Mass.:
405.898
SMILES:
CCCCc1nc2ccccc2n1CC(=O)c1ccc(Cl)c(c1)S(N)(=O)=O
: