Target
Carbonic anhydrase 7
Ligand
BDBM50329833
Substrate
Meas. Tech.
ChEMBL_675714 (CHEMBL1272348)
Kd
30±n/a nM
Citation
 Capkauskaite, EBaranauskiene, LGolovenko, DManakova, EGražulis, STumkevičius, SMatulis, D Indapamide-like benzenesulfonamides as inhibitors of carbonic anhydrases I, II, VII, and XIII. Bioorg Med Chem 18:7357-64 (2010)  
Target
Name:
Carbonic anhydrase 7
Synonyms:
CA-VII CAH7_HUMAN Carbonic anhydrase Carbonic anhydrase VII (CA VII)
Type:
Enzyme
Mol. Mass.:
29664.11
Organism:
Homo sapiens (Human)
Description:
Human cloned isozyme.
Residue:
264
  
Inhibitor
Name:
BDBM50329833
Synonyms:
5-[(1H-Benzimidazol-2-ylsulfanyl)acetyl]-2-chlorobenzenesulfonamide | CHEMBL1271585
Type:
Small organic molecule
Emp. Form.:
C15H12ClN3O3S2
Mol. Mass.:
381.857
SMILES:
NS(=O)(=O)c1cc(ccc1Cl)C(=O)CSc1nc2ccccc2[nH]1
: