Target
Tyrosine-protein kinase JAK2
Ligand
BDBM50331818
Substrate
Meas. Tech.
ChEMBL_686866 (CHEMBL1291235)
IC50
3157±n/a nM
Citation
 Siu, TKozina, ESJung, JRosenstein, CMathur, AAltman, MDChan, GXu, LBachman, EMo, JRBouthillette, MRush, TDinsmore, CJMarshall, CGYoung, JR The discovery of tricyclic pyridone JAK2 inhibitors. Part 1: hit to lead. Bioorg Med Chem Lett 20:7421-5 (2010)  
Target
Name:
Tyrosine-protein kinase JAK2
Synonyms:
JAK-2 JAK2_HUMAN Janus kinase 2 (JAK2) | Janus kinase 2 (a protein tyrosine kinase)
Type:
Protein
Mol. Mass.:
130684.68
Organism:
Homo sapiens (Human)
Description:
O60674
Residue:
1132
  
Inhibitor
Name:
BDBM50331818
Synonyms:
6-(3-amino-2,2-dimethylpropylamino)-9-fluorobenzo[c][1,6]naphthyridin-1(2H)-one | CHEMBL1290310
Type:
Small organic molecule
Emp. Form.:
C17H19FN4O
Mol. Mass.:
314.3574
SMILES:
CC(C)(CN)CNc1nc2cc[nH]c(=O)c2c2cc(F)ccc12
: