Target
Tyrosine-protein kinase JAK2
Ligand
BDBM50331824
Substrate
Meas. Tech.
ChEMBL_686866 (CHEMBL1291235)
IC50
4±n/a nM
Citation
 Siu, TKozina, ESJung, JRosenstein, CMathur, AAltman, MDChan, GXu, LBachman, EMo, JRBouthillette, MRush, TDinsmore, CJMarshall, CGYoung, JR The discovery of tricyclic pyridone JAK2 inhibitors. Part 1: hit to lead. Bioorg Med Chem Lett 20:7421-5 (2010)  
Target
Name:
Tyrosine-protein kinase JAK2
Synonyms:
JAK-2 JAK2_HUMAN Janus kinase 2 (JAK2) | Janus kinase 2 (a protein tyrosine kinase)
Type:
Protein
Mol. Mass.:
130684.68
Organism:
Homo sapiens (Human)
Description:
O60674
Residue:
1132
  
Inhibitor
Name:
BDBM50331824
Synonyms:
6-(2-chloro-4,6-difluorophenylamino)-9-fluorobenzo[c][1,6]naphthyridin-1(2H)-one | CHEMBL1290651
Type:
Small organic molecule
Emp. Form.:
C18H9ClF3N3O
Mol. Mass.:
375.732
SMILES:
Fc1ccc2c(Nc3c(F)cc(F)cc3Cl)nc3cc[nH]c(=O)c3c2c1
: