Target
Tyrosine-protein kinase JAK2
Ligand
BDBM50331829
Substrate
Meas. Tech.
ChEMBL_686866 (CHEMBL1291235)
IC50
27±n/a nM
Citation
 Siu, TKozina, ESJung, JRosenstein, CMathur, AAltman, MDChan, GXu, LBachman, EMo, JRBouthillette, MRush, TDinsmore, CJMarshall, CGYoung, JR The discovery of tricyclic pyridone JAK2 inhibitors. Part 1: hit to lead. Bioorg Med Chem Lett 20:7421-5 (2010)  
Target
Name:
Tyrosine-protein kinase JAK2
Synonyms:
JAK-2 JAK2_HUMAN Janus kinase 2 (JAK2) | Janus kinase 2 (a protein tyrosine kinase)
Type:
Protein
Mol. Mass.:
130684.68
Organism:
Homo sapiens (Human)
Description:
O60674
Residue:
1132
  
Inhibitor
Name:
BDBM50331829
Synonyms:
(S)-9-fluoro-6-(3-methylbutan-2-ylamino)benzo[c][1,6]naphthyridin-1(2H)-one | CHEMBL1289095
Type:
Small organic molecule
Emp. Form.:
C17H18FN3O
Mol. Mass.:
299.3427
SMILES:
CC(C)[C@H](C)Nc1nc2cc[nH]c(=O)c2c2cc(F)ccc12
: