Target
Ribosyldihydronicotinamide dehydrogenase [quinone]
Ligand
BDBM50149893
Substrate
Meas. Tech.
ChEMBL_687953 (CHEMBL1291625)
IC50
7500±n/a nM
Citation
 Nolan, KACaraher, MCHumphries, MPBettley, HABryce, RAStratford, IJ In silico identification and biochemical evaluation of novel inhibitors of NRH:quinone oxidoreductase 2 (NQO2). Bioorg Med Chem Lett 20:7331-6 (2010)  
Target
Name:
Ribosyldihydronicotinamide dehydrogenase [quinone]
Synonyms:
Metallothionein-3 NQO2 NRH dehydrogenase [quinone] 2 QR2 Quinone reductase 2 (NQO2) | Ribosyldihydronicotinamide dehydrogenase [quinone]
Type:
Protein
Mol. Mass.:
25917.25
Organism:
Homo sapiens (Human)
Description:
P16083
Residue:
231
  
Inhibitor
Name:
BDBM50149893
Synonyms:
4-(6-Methoxy-quinolin-8-ylamino)-pentyl-ammonium PRIMAQUINE
Type:
Small organic molecule
Emp. Form.:
C15H22N3O
Mol. Mass.:
260.3541
SMILES:
COc1cc(NC(C)CCC[NH3+])c2ncccc2c1
: