Target
Metabotropic glutamate receptor 1
Ligand
BDBM50333368
Substrate
Meas. Tech.
ChEMBL_698433 (CHEMBL1647365)
Ki
0.870000±n/a nM
Citation
 Fujinaga, MYamasaki, TKawamura, KKumata, KHatori, AYui, JYanamoto, KYoshida, YOgawa, MNengaki, NMaeda, JFukumura, TZhang, MR Synthesis and evaluation of 6-[1-(2-[(18)F]fluoro-3-pyridyl)-5-methyl-1H-1,2,3-triazol-4-yl]quinoline for positron emission tomography imaging of the metabotropic glutamate receptor type 1 in brain. Bioorg Med Chem 19:102-10 (2011)  
Target
Name:
Metabotropic glutamate receptor 1
Synonyms:
GPRC1A GRM1_HUMAN Metabotropic Glutamate 1a | metabotropic glutamate 1
Type:
Enzyme
Mol. Mass.:
132358.19
Organism:
Homo sapiens (Human)
Description:
Q13255
Residue:
1194
  
Inhibitor
Name:
BDBM50333368
Synonyms:
CHEMBL1645348 | [11C]-cis-(3-ethyl-2-methylquinolin-6-yl)(4-methoxycyclohexyl)methanone
Type:
Small organic molecule
Emp. Form.:
C20H25NO2
Mol. Mass.:
311.418
SMILES:
CCc1cc2cc(ccc2nc1C)C(=O)[C@@H]1CC[C@@H](CC1)OC
: