Target
Tyrosine-protein phosphatase non-receptor type 7
Ligand
BDBM50333645
Substrate
Meas. Tech.
ChEMBL_699963 (CHEMBL1646370)
IC50
152700±n/a nM
Citation
 Scott, LMChen, LDaniel, KGBrooks, WHGuida, WCLawrence, HRSebti, SMLawrence, NJWu, J Shp2 protein tyrosine phosphatase inhibitor activity of estramustine phosphate and its triterpenoid analogs. Bioorg Med Chem Lett 21:730-3 (2011)  
Target
Name:
Tyrosine-protein phosphatase non-receptor type 7
Synonyms:
He-PTP Hematopoietic protein-tyrosine phosphatase (HEPTP) PTPN7 Tyrosine-protein phosphatase non-receptor type 7 | Tyrosine-protein phosphatase non-receptor type 7 (HEPTP)
Type:
Protein
Mol. Mass.:
40530.79
Organism:
Homo sapiens (Human)
Description:
P35236
Residue:
360
  
Inhibitor
Name:
BDBM50333645
Synonyms:
CHEMBL1756 | Estramustine phosphate
Type:
Small organic molecule
Emp. Form.:
C23H32Cl2NO6P
Mol. Mass.:
520.383
SMILES:
C[C@]12CC[C@H]3[C@@H](CCc4cc(OC(=O)N(CCCl)CCCl)ccc34)[C@@H]1CC[C@@H]2OP(O)(O)=O
: