Target
Carbonic anhydrase
Ligand
BDBM26990
Substrate
Meas. Tech.
ChEMBL_700658 (CHEMBL1645697)
Ki
580000±n/a nM
Citation
 Bertucci, AInnocenti, AScozzafava, ATambutté, SZoccola, DSupuran, CT Carbonic anhydrase inhibitors. Inhibition studies with anions and sulfonamides of a new cytosolic enzyme from the scleractinian coral Stylophora pistillata. Bioorg Med Chem Lett 21:710-4 (2011)  
Target
Name:
Carbonic anhydrase
Synonyms:
Alpha carbonic anhydrase
Type:
PROTEIN
Mol. Mass.:
36650.57
Organism:
Stylophora pistillata
Description:
ChEMBL_700658
Residue:
323
  
Inhibitor
Name:
BDBM26990
Synonyms:
CHEMBL1644699 HS(-1) hydrosulfide | sulfanide
Type:
Ion
Emp. Form.:
HS
Mol. Mass.:
33.073
SMILES:
[SH-]
: