Target
Carbonic anhydrase
Ligand
BDBM29278
Substrate
Meas. Tech.
ChEMBL_700659 (CHEMBL1645698)
Ki
104±n/a nM
Citation
 Bertucci, AInnocenti, AScozzafava, ATambutté, SZoccola, DSupuran, CT Carbonic anhydrase inhibitors. Inhibition studies with anions and sulfonamides of a new cytosolic enzyme from the scleractinian coral Stylophora pistillata. Bioorg Med Chem Lett 21:710-4 (2011)  
Target
Name:
Carbonic anhydrase
Synonyms:
Type:
PROTEIN
Mol. Mass.:
35119.71
Organism:
Stylophora pistillata
Description:
ChEMBL_700659
Residue:
316
  
Inhibitor
Name:
BDBM29278
Synonyms:
CHEMBL310671 SAC Saccharin
Type:
Small organic molecule
Emp. Form.:
C7H5NO3S
Mol. Mass.:
183.185
SMILES:
O=C1NS(=O)(=O)c2ccccc12
: