Target
Carbonic anhydrase 1
Ligand
BDBM26979
Substrate
Meas. Tech.
ChEMBL_700655 (CHEMBL1645694)
Ki
6000000±n/a nM
Citation
 Bertucci, AInnocenti, AScozzafava, ATambutté, SZoccola, DSupuran, CT Carbonic anhydrase inhibitors. Inhibition studies with anions and sulfonamides of a new cytosolic enzyme from the scleractinian coral Stylophora pistillata. Bioorg Med Chem Lett 21:710-4 (2011)  
Target
Name:
Carbonic anhydrase 1
Synonyms:
CA-I CAB Carbonate dehydratase I Carbonic anhydrase 1 (CA I) Carbonic anhydrase 1 (Recombinant CA I) Carbonic anhydrase B Carbonic anhydrase I (CA I) Carbonic anhydrase I (CAI) Carbonic anhydrase isoenzyme I (hCA I) | hCA
Type:
Enzyme
Mol. Mass.:
28873.37
Organism:
Homo sapiens (Human)
Description:
P00915
Residue:
261
  
Inhibitor
Name:
BDBM26979
Synonyms:
CHEMBL69710 POTASSIUM CHLORIDE chloride | chloride ion
Type:
Ion
Emp. Form.:
Cl
Mol. Mass.:
35.454
SMILES:
[Cl-]
: