Target
Carbonic anhydrase 6
Ligand
BDBM10885
Substrate
Meas. Tech.
ChEMBL_700657 (CHEMBL1645696)
Ki
0.9±n/a nM
Citation
 Bertucci, AInnocenti, AScozzafava, ATambutté, SZoccola, DSupuran, CT Carbonic anhydrase inhibitors. Inhibition studies with anions and sulfonamides of a new cytosolic enzyme from the scleractinian coral Stylophora pistillata. Bioorg Med Chem Lett 21:710-4 (2011)  
Target
Name:
Carbonic anhydrase 6
Synonyms:
CA-VI CAH6_HUMAN Carbonic Anhydrase VI Carbonic anhydrase 6 Carbonic anhydrase 6 (CA-VI) Salivary carbonic anhydrase | Secreted carbonic anhydrase
Type:
Enzyme
Mol. Mass.:
35371.40
Organism:
Homo sapiens (Human)
Description:
P23280
Residue:
308
  
Inhibitor
Name:
BDBM10885
Synonyms:
(4R)-4-(ethylamino)-2-(3-methoxypropyl)-1,1-dioxo-2H,3H,4H-1,7,2-thieno[3,2-e][1,2]thiazine-6-sulfonamide AL-4862 Brinzolamide (BRZ) | brinzolamide
Type:
Small organic molecule
Emp. Form.:
C12H21N3O5S3
Mol. Mass.:
383.507
SMILES:
CCN[C@H]1CN(CCCOC)S(=O)(=O)c2sc(cc12)S(N)(=O)=O
: