Target
Cytochrome P450 3A4
Ligand
BDBM93624
Substrate
Meas. Tech.
ChEMBL_700827 (CHEMBL1646221)
IC50
600±n/a nM
Citation
 Manning, DDCioffi, CLUsyatinsky, AFitzpatrick, KMasih, LGuo, CZhang, ZChoo, SHSikkander, MIRyan, KNNaginskaya, JHassler, CDobritsa, SWierschke, JDEarley, WGButler, ASBrady, CABarnes, NMCohen, MLGuzzo, PR Novel serotonin type 3 receptor partial agonists for the potential treatment of irritable bowel syndrome. Bioorg Med Chem Lett 21:58-61 (2010)  
Target
Name:
Cytochrome P450 3A4
Synonyms:
Albendazole monooxygenase CP3A4_HUMAN CYP3A4 CYPIIIA4 Cytochrome P450 3A4 (CYP3A4) Nifedipine oxidase Taurochenodeoxycholate 6-alpha-hydroxylase
Type:
Enzyme
Mol. Mass.:
57349.57
Organism:
Homo sapiens (Human)
Description:
Residue:
503
  
Inhibitor
Name:
BDBM93624
Synonyms:
5-methyl-2-[(5-methyl-1H-imidazol-4-yl)methyl]-3,4-dihydropyrid[4,3-b]indol-1-one;hydrochloride ALOSETRON MLS001401464 cid_60758
Type:
Small organic molecule
Emp. Form.:
C17H18N4O
Mol. Mass.:
294.351
SMILES:
Cc1nc[nH]c1CN1CCc2c(C1=O)c1ccccc1n2C
: