Target
5-hydroxytryptamine receptor 3A
Ligand
BDBM50334452
Substrate
Meas. Tech.
ChEMBL_700634 (CHEMBL1648623)
Ki
0.9±n/a nM
Citation
 Manning, DDCioffi, CLUsyatinsky, AFitzpatrick, KMasih, LGuo, CZhang, ZChoo, SHSikkander, MIRyan, KNNaginskaya, JHassler, CDobritsa, SWierschke, JDEarley, WGButler, ASBrady, CABarnes, NMCohen, MLGuzzo, PR Novel serotonin type 3 receptor partial agonists for the potential treatment of irritable bowel syndrome. Bioorg Med Chem Lett 21:58-61 (2010)  
Target
Name:
5-hydroxytryptamine receptor 3A
Synonyms:
5-HT-3 5-HT3A 5-hydroxytryptamine receptor 3 (5-HT3) 5-hydroxytryptamine receptor 3A (5HT3A) 5HT3R HTR3A Serotonin 3 receptor (5HT3) Serotonin-gated ion channel receptor | Serotonin-gated ion channel receptor 3
Type:
Protein
Mol. Mass.:
55283.27
Organism:
Homo sapiens (Human)
Description:
P46098
Residue:
478
  
Inhibitor
Name:
BDBM50334452
Synonyms:
(R)-5-methyl-2-(quinuclidin-3-yl)-2,3-dihydropyrrolo[4,3,2-de]isoquinolin-1(5H)-one | CHEMBL1643893
Type:
Small organic molecule
Emp. Form.:
C18H21N3O
Mol. Mass.:
295.3788
SMILES:
Cn1cc2CN([C@H]3CN4CCC3CC4)C(=O)c3cccc1c23
: