Target
5-hydroxytryptamine receptor 7
Ligand
BDBM50334530
Substrate
Meas. Tech.
ChEMBL_701285 (CHEMBL1648905)
Ki
10000±n/a nM
Citation
 Rudolph, DADvorak, CADvorak, LNepomuceno, DBonaventure, PLovenberg, TWCarruthers, NI Novel tetrahydropyrido[3,2-c]pyrroles as 5-HT(7) antagonists. Bioorg Med Chem Lett 21:42-4 (2010)  
Target
Name:
5-hydroxytryptamine receptor 7
Synonyms:
5-HT-7 5-HT7 5-HT7S 5-hydroxytryptamine receptor 7 5HT7R_RAT GPRFO Serotonin (5-HT) receptor | Serotonin Receptor 7
Type:
G Protein-Coupled Receptor (GPCR)
Mol. Mass.:
49852.62
Organism:
Rattus norvegicus (rat)
Description:
Rat cloned 5-HT7R.
Residue:
448
  
Inhibitor
Name:
BDBM50334530
Synonyms:
4-(1-benzyl-4,5,6,7-tetrahydro-1H-pyrrolo[3,2-c]pyridin-3-yl)phenol | CHEMBL1644281
Type:
Small organic molecule
Emp. Form.:
C20H20N2O
Mol. Mass.:
304.3856
SMILES:
Oc1ccc(cc1)-c1cn(Cc2ccccc2)c2CCNCc12
: