Target
D(2) dopamine receptor
Ligand
BDBM50334732
Substrate
Meas. Tech.
ChEMBL_699288 (CHEMBL1647108)
Ki
>5000±n/a nM
Citation
 Liu, KGRobichaud, AJGreenfield, AALo, JRGrosanu, CMattes, JFCai, YZhang, GMZhang, JYKowal, DMSmith, DLDi, LKerns, EHSchechter, LEComery, TA Identification of 3-sulfonylindazole derivatives as potent and selective 5-HT(6) antagonists. Bioorg Med Chem 19:650-62 (2011)  
Target
Name:
D(2) dopamine receptor
Synonyms:
D(2) dopamine receptor DOPAMINE D2 Long DRD2 Dopamine D2 receptor Dopamine D2 receptor (D2R) Dopamine2-like | d2
Type:
Cell-surface receptors
Mol. Mass.:
50647.10
Organism:
Homo sapiens (Human)
Description:
P14416
Residue:
443
  
Inhibitor
Name:
BDBM50334732
Synonyms:
3-(3-Chlorophenylsulfonyl)-N-(piperidin-4-yl)-1H-indazol-5-amine HCl | CHEMBL1642882
Type:
Small organic molecule
Emp. Form.:
C18H19ClN4O2S
Mol. Mass.:
390.887
SMILES:
Clc1cccc(c1)S(=O)(=O)c1n[nH]c2ccc(NC3CCNCC3)cc12
: