Target
Serine/threonine-protein kinase Chk1
Ligand
BDBM50334852
Substrate
Meas. Tech.
ChEMBL_699554 (CHEMBL1647912)
IC50
9±n/a nM
Citation
 Dwyer, MPParuch, KLabroli, MAlvarez, CKeertikar, KMPoker, CRossman, RFischmann, TODuca, JSMadison, VParry, DDavis, NSeghezzi, WWiswell, DGuzi, TJ Discovery of pyrazolo[1,5-a]pyrimidine-based CHK1 inhibitors: a template-based approach--part 1. Bioorg Med Chem Lett 21:467-70 (2010)  
Target
Name:
Serine/threonine-protein kinase Chk1
Synonyms:
CHEK1 CHK1 checkpoint homolog Checkpoint kinase-1 (CHK1)
Type:
Enzyme Catalytic Domain
Mol. Mass.:
54443.02
Organism:
Homo sapiens (Human)
Description:
gi_166295192
Residue:
476
  
Inhibitor
Name:
BDBM50334852
Synonyms:
3-methyl-N-(3-(1-methyl-1H-pyrazol-4-yl)-5-(piperidin-3-yl)pyrazolo[1,5-a]pyrimidin-7-yl)isothiazol-5-amine | CHEMBL1643206
Type:
Small organic molecule
Emp. Form.:
C19H22N8S
Mol. Mass.:
394.497
SMILES:
Cc1cc(Nc2cc(nc3c(cnn23)-c2cnn(C)c2)C2CCCNC2)sn1
: