Target
Sphingosine 1-phosphate receptor 1
Ligand
BDBM50335453
Substrate
Meas. Tech.
ChEMBL_701955 (CHEMBL1657527)
EC50
510±n/a nM
Citation
 Saha, AKYu, XLin, JLobera, MSharadendu, AChereku, SSchutz, NSegal, DMarantz, YMcCauley, DMiddleton, SSiu, JBörli, RWBuys, JHorner, MSalyers, KSchrag, MVargas, HMXu, YMcElvain, M Benzofuran Derivatives as Potent, Orally Active S1P1 Receptor Agonists: A Preclinical Lead Molecule for MS ACS Med Chem Lett 2:97-101 (2011)  
Target
Name:
Sphingosine 1-phosphate receptor 1
Synonyms:
CHEDG1 Endothelial differentiation G-protein coupled receptor 1 S1P1 S1PR1_HUMAN Sphingosine 1-phosphate receptor Edg-1
Type:
Enzyme
Mol. Mass.:
42836.02
Organism:
Homo sapiens (Human)
Description:
P21453
Residue:
382
  
Inhibitor
Name:
BDBM50335453
Synonyms:
1-(4-(5-phenoxybenzofuran-2-yl)benzyl)azetidine-3-carboxylic acid | CHEMBL1651707
Type:
Small organic molecule
Emp. Form.:
C25H21NO4
Mol. Mass.:
399.4385
SMILES:
OC(=O)C1CN(Cc2ccc(cc2)-c2cc3cc(Oc4ccccc4)ccc3o2)C1
: