Target
Acetylcholinesterase
Ligand
BDBM50336116
Substrate
Meas. Tech.
ChEMBL_718128 (CHEMBL1671581)
IC50
0.7±n/a nM
Citation
 Musilek, KKomloova, MHolas, OHrabinova, MPohanka, MDohnal, VNachon, FDolezal, MKuca, K Preparation and in vitro screening of symmetrical bis-isoquinolinium cholinesterase inhibitors bearing various connecting linkage--implications for early Myasthenia gravis treatment. Eur J Med Chem 46:811-8 (2011)  
Target
Name:
Acetylcholinesterase
Synonyms:
ACES_HUMAN Acetylcholinesterase (AChE) | Acetylcholinesterase (human AChE)
Type:
Enzyme
Mol. Mass.:
67792.70
Organism:
Homo sapiens (Human)
Description:
P22303
Residue:
614
  
Inhibitor
Name:
BDBM50336116
Synonyms:
Ambenonium dichloride | CHEMBL1669479
Type:
Small organic molecule
Emp. Form.:
C24H34Cl2N4O2
Mol. Mass.:
481.457
SMILES:
C[N+](C)(CCNC(=O)C(=O)NCC[N+](C)(C)Cc1ccccc1Cl)Cc1ccccc1Cl
: