Target
Trace amine-associated receptor 1
Ligand
BDBM50336205
Substrate
Meas. Tech.
ChEMBL_716460 (CHEMBL1670084)
Ki
942±n/a nM
Citation
 Stalder, HHoener, MCNorcross, RD Selective antagonists of mouse trace amine-associated receptor 1 (mTAAR1): discovery of EPPTB (RO5212773). Bioorg Med Chem Lett 21:1227-31 (2011)  
Target
Name:
Trace amine-associated receptor 1
Synonyms:
TAAR1_RAT Taar1 Trace amine receptor 1 (TARR1) Trace amine-associated receptor 1 (TAAR1) Trar1
Type:
Enzyme
Mol. Mass.:
38034.73
Organism:
Rattus norvegicus (Rat)
Description:
Q923Y9
Residue:
332
  
Inhibitor
Name:
BDBM50336205
Synonyms:
(N-(3-Ethoxy-phenyl)-4-pyrrolidin-1-yl-3-trifluoromethyl-benzamide | CHEMBL1669669
Type:
Small organic molecule
Emp. Form.:
C20H21F3N2O2
Mol. Mass.:
378.3881
SMILES:
CCOc1cccc(NC(=O)c2ccc(N3CCCC3)c(c2)C(F)(F)F)c1
: