Target
Cytochrome P450 3A4
Ligand
BDBM50336345
Substrate
Meas. Tech.
ChEMBL_716717 (CHEMBL1670542)
IC50
>30000±n/a nM
Citation
 Nishizawa, RNishiyama, THisaichi, KMinamoto, CMatsunaga, NTakaoka, YNakai, HJenkinson, SKazmierski, WMTada, HSagawa, KShibayama, SFukushima, DMaeda, KMitsuya, H Spirodiketopiperazine-based CCR5 antagonist: discovery of an antiretroviral drug candidate. Bioorg Med Chem Lett 21:1141-5 (2011)  
Target
Name:
Cytochrome P450 3A4
Synonyms:
Albendazole monooxygenase CP3A4_HUMAN CYP3A4 CYPIIIA4 Cytochrome P450 3A4 (CYP3A4) Nifedipine oxidase Taurochenodeoxycholate 6-alpha-hydroxylase
Type:
Enzyme
Mol. Mass.:
57349.57
Organism:
Homo sapiens (Human)
Description:
Residue:
503
  
Inhibitor
Name:
BDBM50336345
Synonyms:
4-(4-(((R)-1-butyl-3-((R)-cyclohexyl(hydroxy)methyl)-2,5-dioxo-1,4,9-triazaspiro[5.5]undecan-9-yl)methyl)phenoxy)benzoic acid hydrochloride CHEMBL1668019
Type:
Small organic molecule
Emp. Form.:
C33H43N3O6
Mol. Mass.:
577.711
SMILES:
CCCCN1C(=O)[C@H](NC(=O)C11CCN(Cc2ccc(Oc3ccc(cc3)C(O)=O)cc2)CC1)[C@H](O)C1CCCCC1
: