Target
C-C chemokine receptor type 5
Ligand
BDBM50336345
Substrate
Meas. Tech.
ChEMBL_716714 (CHEMBL1670539)
IC50
5.62±n/a nM
Citation
 Nishizawa, RNishiyama, THisaichi, KMinamoto, CMatsunaga, NTakaoka, YNakai, HJenkinson, SKazmierski, WMTada, HSagawa, KShibayama, SFukushima, DMaeda, KMitsuya, H Spirodiketopiperazine-based CCR5 antagonist: discovery of an antiretroviral drug candidate. Bioorg Med Chem Lett 21:1141-5 (2011)  
Target
Name:
C-C chemokine receptor type 5
Synonyms:
C-C CKR-5 CC-CKR-5 CCR5 CCR5_HUMAN CHEMR13 HIV-1 fusion coreceptor
Type:
Enzyme
Mol. Mass.:
40540.21
Organism:
Homo sapiens (Human)
Description:
P51681
Residue:
352
  
Inhibitor
Name:
BDBM50336345
Synonyms:
4-(4-(((R)-1-butyl-3-((R)-cyclohexyl(hydroxy)methyl)-2,5-dioxo-1,4,9-triazaspiro[5.5]undecan-9-yl)methyl)phenoxy)benzoic acid hydrochloride CHEMBL1668019
Type:
Small organic molecule
Emp. Form.:
C33H43N3O6
Mol. Mass.:
577.711
SMILES:
CCCCN1C(=O)[C@H](NC(=O)C11CCN(Cc2ccc(Oc3ccc(cc3)C(O)=O)cc2)CC1)[C@H](O)C1CCCCC1
: