Target
Dihydrofolate reductase
Ligand
BDBM50335530
Substrate
Meas. Tech.
ChEMBL_723694 (CHEMBL1677364)
IC50
2.90±n/a nM
Citation
 Bourne, CRBarrow, EWBunce, RABourne, PCBerlin, KDBarrow, WW Inhibition of antibiotic-resistant Staphylococcus aureus by the broad-spectrum dihydrofolate reductase inhibitor RAB1. Antimicrob Agents Chemother 54:3825-33 (2010)  
Target
Name:
Dihydrofolate reductase
Synonyms:
DYR_STAAU Dihydrofolate reductase Tetrahydrofolate dehydrogenase | folA
Type:
Enzyme
Mol. Mass.:
18249.71
Organism:
Staphylococcus aureus
Description:
Residue:
159
  
Inhibitor
Name:
BDBM50335530
Synonyms:
(S)-3-(5-((2,4-diaminopyrimidin-5-yl)methyl)-2,3-dimethoxyphenyl)-1-(1-propylphthalazin-2(1H)-yl)prop-2-en-1-one 5-(3,4-dimethoxy-5-{(1E)-3-oxo-3-[(1S)-1-propylphthalazin-2(1H)-yl]prop-1-en-1-yl}benzyl)pyrimidine-2,4-diamine | CHEMBL1235617
Type:
Small organic molecule
Emp. Form.:
C27H30N6O3
Mol. Mass.:
486.5655
SMILES:
CCC[C@@H]1N(N=Cc2ccccc12)C(=O)\C=C\c1cc(Cc2cnc(N)nc2N)cc(OC)c1OC
: