Target
Lanosterol 14a-demethylase
Ligand
BDBM31774
Substrate
Meas. Tech.
ChEMBL_724295 (CHEMBL1677688)
Kd
103±n/a nM
Citation
 Warrilow, AGMelo, NMartel, CMParker, JENes, WDKelly, SLKelly, DE Expression, purification, and characterization of Aspergillus fumigatus sterol 14-alpha demethylase (CYP51) isoenzymes A and B. Antimicrob Agents Chemother 54:4225-34 (2010)  
Target
Name:
Lanosterol 14a-demethylase
Synonyms:
14-alpha sterol demethylase
Type:
PROTEIN
Mol. Mass.:
58939.22
Organism:
Neosartorya fumigata
Description:
ChEMBL_724288
Residue:
524
  
Inhibitor
Name:
BDBM31774
Synonyms:
CHEMBL104 Clotrimazole Mycelex cid_2812
Type:
Small organic molecule
Emp. Form.:
C22H17ClN2
Mol. Mass.:
344.837
SMILES:
Clc1ccccc1C(c1ccccc1)(c1ccccc1)n1ccnc1
: