Target
Nuclear receptor subfamily 1 group I member 2
Ligand
BDBM50314969
Substrate
Meas. Tech.
ChEMBL_718492 (CHEMBL1680287)
IC50
3500±n/a nM
Citation
 Sebhat, IKFranklin, CLo, MMChen, DJewell, JPMiller, RPang, JPalyha, OKan, YKelly, TMGuan, XMMarsh, DJKosinski, JAMetzger, JMLyons, KDragovic, JGuzzo, PRHenderson, AJReitman, MLNargund, RPWyvratt, MJ Discovery of MK-5046, a Potent, Selective Bombesin Receptor Subtype-3 Agonist for the Treatment of Obesity ACS Med Chem Lett 2:43-47 (2011)  
Target
Name:
Nuclear receptor subfamily 1 group I member 2
Synonyms:
NR1I2 Orphan nuclear receptor PAR1 PXR SXR nuclear receptor subfamily 1 group I member 2 isoform 1
Type:
Nuclear receptor
Mol. Mass.:
49774.77
Organism:
Homo sapiens (Human)
Description:
O75469
Residue:
434
  
Inhibitor
Name:
BDBM50314969
Synonyms:
2-(4-(2-(4-(2,2-dimethylbutyl)-1H-imidazol-2-yl)ethyl)phenyl)pyridine | CHEMBL1091720
Type:
Small organic molecule
Emp. Form.:
C22H27N3
Mol. Mass.:
333.4699
SMILES:
CCC(C)(C)Cc1cnc(CCc2ccc(cc2)-c2ccccn2)[nH]1
: