Target
Aromatase
Ligand
BDBM50337117
Substrate
Meas. Tech.
ChEMBL_718780 (CHEMBL1681078)
IC50
0.1±n/a nM
Citation
 Woo, LWBubert, CPurohit, A Hybrid Dual Aromatase-Steroid Sulfatase Inhibitors with Exquisite Picomolar Inhibitory Activity ACS Med Chem Lett 2:243-247 (2011)  
Target
Name:
Aromatase
Synonyms:
ARO1 CP19A_HUMAN CYP19 CYPXIX Cytochrome P450 19A1 Cytochrome P450-C19 (CYP19) FL cytokine receptor precursor | P-450AROM
Type:
Enzyme
Mol. Mass.:
57888.92
Organism:
Homo sapiens (Human)
Description:
P11511
Residue:
503
  
Inhibitor
Name:
BDBM50337117
Synonyms:
5'-(benzyl(4H-1,2,4-triazol-4-yl)amino)-2'-cyanobiphenyl-4-yl sulfamate | CHEMBL1672974
Type:
Small organic molecule
Emp. Form.:
C22H18N6O3S
Mol. Mass.:
446.482
SMILES:
NS(=O)(=O)Oc1ccc(cc1)-c1cc(ccc1C#N)N(Cc1ccccc1)n1cnnc1
: