Target
Carbonic anhydrase 2
Ligand
BDBM50339588
Substrate
Meas. Tech.
ChEMBL_736727 (CHEMBL1695108)
Ki
8600±n/a nM
Citation
 Davis, RAHofmann, AOsman, AHall, RAMühlschlegel, FAVullo, DInnocenti, ASupuran, CTPoulsen, SA Natural product-based phenols as novel probes for mycobacterial and fungal carbonic anhydrases. J Med Chem 54:1682-92 (2011)  
Target
Name:
Carbonic anhydrase 2
Synonyms:
CA-II CAC Carbonate dehydratase II Carbonic anhydrase 2 (CA-II) Carbonic anhydrase C Carbonic anhydrase II (CA-II) Carbonic anhydrase II (hCA II) | Carbonic anhydrase isoenzyme II (hCA II)
Type:
Enzyme
Mol. Mass.:
29250.71
Organism:
Homo sapiens (Human)
Description:
P00918
Residue:
260
  
Inhibitor
Name:
BDBM50339588
Synonyms:
(3-CHLORO-4-HYDROXYPHENYL)ACETIC ACID 3-chloro-4-hydroxyphenylacetic acid | CHEMBL592010
Type:
Small organic molecule
Emp. Form.:
C8H7ClO3
Mol. Mass.:
186.592
SMILES:
OC(=O)Cc1ccc(O)c(Cl)c1
: