Target
C-C chemokine receptor type 5
Ligand
BDBM50104931
Substrate
Meas. Tech.
ChEMBL_739992 (CHEMBL1763052)
IC50
40±n/a nM
Citation
 Skerlj, RBridger, GZhou, YBourque, ELangille, JDi Fluri, MBogucki, DYang, WLi, TWang, LNan, SBaird, IMetz, MDarkes, MLabrecque, JLau, GFricker, SHuskens, DSchols, D Design and synthesis of pyridin-2-yloxymethylpiperidin-1-ylbutyl amide CCR5 antagonists that are potent inhibitors of M-tropic (R5) HIV-1 replication. Bioorg Med Chem Lett 21:2450-5 (2011)  
Target
Name:
C-C chemokine receptor type 5
Synonyms:
C-C CKR-5 CC-CKR-5 CCR5 CCR5_HUMAN CHEMR13 HIV-1 fusion coreceptor
Type:
Enzyme
Mol. Mass.:
40540.21
Organism:
Homo sapiens (Human)
Description:
P51681
Residue:
352
  
Inhibitor
Name:
BDBM50104931
Synonyms:
(4-{(4-Bromo-phenyl)-[(E)-ethoxyimino]-methyl}-4''-methyl-[1,4'']bipiperidinyl-1''-yl)-(2,4-dimethyl-1-oxy-pyridin-3-yl)-methanone (4-{(4-Bromo-phenyl)-[(Z)-ethoxyimino]-methyl}-4'-methyl-[1,4']bipiperidinyl-1'-yl)-(2,4-dimethyl-1-oxy-pyridin-3-yl)-methanone CHEMBL336672 SCH-351125 | {4-[(4-Bromo-phenyl)-ethoxyimino-methyl]-4''-methyl-[1,4'']bipiperidinyl-1''-yl}-(2,4-dimethyl-1-oxy-pyridin-3-yl)-methanone
Type:
Small organic molecule
Emp. Form.:
C28H37BrN4O3
Mol. Mass.:
557.522
SMILES:
CCO[N-][C+](C1CCN(CC1)C1(C)CCN(CC1)C(=O)c1c(C)cc[n+]([O-])c1C)c1ccc(Br)cc1
: