Target
Mas-related G-protein coupled receptor member X1
Ligand
BDBM50340746
Substrate
Meas. Tech.
ChEMBL_740644 (CHEMBL1763646)
IC50
40±n/a nM
Citation
 Bayrakdarian, MButterworth, JHu, YJSanthakumar, VTomaszewski, MJ Development of 2,4-diaminopyrimidine derivatives as novel SNSR4 antagonists. Bioorg Med Chem Lett 21:2102-5 (2011)  
Target
Name:
Mas-related G-protein coupled receptor member X1
Synonyms:
MRGPRX1 MRGX1_HUMAN SNSR4
Type:
PROTEIN
Mol. Mass.:
36253.68
Organism:
Homo sapiens (Human)
Description:
ChEMBL_516621
Residue:
322
  
Inhibitor
Name:
BDBM50340746
Synonyms:
2-(4-(2-(4-chlorophenethylamino)pyrimidin-4-yl)piperazin-1-yl)-N-(pyridin-4-ylmethyl)-N-((tetrahydrofuran-2-yl)methyl)acetamide | CHEMBL1762701
Type:
Small organic molecule
Emp. Form.:
C29H36ClN7O2
Mol. Mass.:
550.095
SMILES:
Clc1ccc(CCNc2nccc(n2)N2CCN(CC(=O)N(CC3CCCO3)Cc3ccncc3)CC2)cc1
: