Target
Mas-related G-protein coupled receptor member X1
Ligand
BDBM50340752
Substrate
Meas. Tech.
ChEMBL_740644 (CHEMBL1763646)
IC50
330±n/a nM
Citation
 Bayrakdarian, MButterworth, JHu, YJSanthakumar, VTomaszewski, MJ Development of 2,4-diaminopyrimidine derivatives as novel SNSR4 antagonists. Bioorg Med Chem Lett 21:2102-5 (2011)  
Target
Name:
Mas-related G-protein coupled receptor member X1
Synonyms:
MRGPRX1 MRGX1_HUMAN SNSR4
Type:
PROTEIN
Mol. Mass.:
36253.68
Organism:
Homo sapiens (Human)
Description:
ChEMBL_516621
Residue:
322
  
Inhibitor
Name:
BDBM50340752
Synonyms:
CHEMBL1762706 | N-benzyl-2-(4-(2-(4-chlorophenethylamino)pyrimidin-4-yl)piperazin-1-yl)-N-ethylacetamide
Type:
Small organic molecule
Emp. Form.:
C27H33ClN6O
Mol. Mass.:
493.044
SMILES:
CCN(Cc1ccccc1)C(=O)CN1CCN(CC1)c1ccnc(NCCc2ccc(Cl)cc2)n1
: