Target
Mas-related G-protein coupled receptor member X1
Ligand
BDBM50340753
Substrate
Meas. Tech.
ChEMBL_740644 (CHEMBL1763646)
IC50
14±n/a nM
Citation
 Bayrakdarian, MButterworth, JHu, YJSanthakumar, VTomaszewski, MJ Development of 2,4-diaminopyrimidine derivatives as novel SNSR4 antagonists. Bioorg Med Chem Lett 21:2102-5 (2011)  
Target
Name:
Mas-related G-protein coupled receptor member X1
Synonyms:
MRGPRX1 MRGX1_HUMAN SNSR4
Type:
PROTEIN
Mol. Mass.:
36253.68
Organism:
Homo sapiens (Human)
Description:
ChEMBL_516621
Residue:
322
  
Inhibitor
Name:
BDBM50340753
Synonyms:
2-(4-(2-(4-chlorophenethylamino)pyrimidin-4-yl)piperazin-1-yl)-N-((3,5-dichloropyridin-4-yl)methyl)-N-(3-morpholinopropyl)acetamide | CHEMBL1762707
Type:
Small organic molecule
Emp. Form.:
C31H39Cl3N8O2
Mol. Mass.:
662.053
SMILES:
Clc1ccc(CCNc2nccc(n2)N2CCN(CC(=O)N(CCCN3CCOCC3)Cc3c(Cl)cncc3Cl)CC2)cc1
: