Target
Cytochrome P450 2D6
Ligand
BDBM50051293
Substrate
Meas. Tech.
ChEMBL_740076 (CHEMBL1763136)
IC50
18000±n/a nM
Citation
 Hoveyda, HRRoy, MOBlanc, SNoël, SSalvino, JMAtor, MAFraser, G Discovery of 3-aryl-5-acylpiperazinyl-pyrazoles as antagonists to the NK3 receptor. Bioorg Med Chem Lett 21:1991-6 (2011)  
Target
Name:
Cytochrome P450 2D6
Synonyms:
CP2D6_HUMAN CYP2DL1 Cytochrome P450 2D6 (CYP2D6) P450-DB1
Type:
Protein
Mol. Mass.:
55774.82
Organism:
Homo sapiens (Human)
Description:
P10635
Residue:
497
  
Inhibitor
Name:
BDBM50051293
Synonyms:
(S)-(-)-N-(R-ethylbenzyl)-3-hydroxy-2-phenylquinoline-4-carboxamide 3-Hydroxy-2-phenyl-quinoline-4-carboxylic acid (1-phenyl-propyl)-amide SB 223412 SB-223412 | Talnetant
Type:
Small organic molecule
Emp. Form.:
C25H22N2O2
Mol. Mass.:
382.4544
SMILES:
CC[C@H](NC(=O)c1c(O)c(nc2ccccc12)-c1ccccc1)c1ccccc1
: