Target
Cannabinoid receptor 2
Ligand
BDBM50341929
Substrate
Meas. Tech.
ChEMBL_743422 (CHEMBL1767776)
IC50
0.82±n/a nM
Citation
 Manley, PJZartman, APaone, DVBurgey, CSHenze, DADella Penna, KDesai, RLeitl, MDLemaire, WWhite, RBYeh, SUrban, MOKane, SAHartman, GDBilodeau, MTTrotter, BW Decahydroquinoline amides as highly selective CB2 agonists: role of selectivity on in vivo efficacy in a rodent model of analgesia. Bioorg Med Chem Lett 21:2359-64 (2011)  
Target
Name:
Cannabinoid receptor 2
Synonyms:
CANNABINOID CB2 CB2 CB2B CNR2_HUMAN Cannabinoid CB2 receptor Cannabinoid receptor 2 (CB2R) | hCB2
Type:
G Protein-Coupled Receptor (GPCR)
Mol. Mass.:
39690.94
Organism:
Homo sapiens (Human)
Description:
P34972
Residue:
360
  
Inhibitor
Name:
BDBM50341929
Synonyms:
CHEMBL1765161 | cis-((4R,4aS,8aR)-4-hydroxy-4-phenyloctahydroquinolin-1(2H)-yl)(quinolin-2-yl)methanone
Type:
Small organic molecule
Emp. Form.:
C25H26N2O2
Mol. Mass.:
386.4861
SMILES:
O[C@@]1(CCN([C@@H]2CCCC[C@H]12)C(=O)c1ccc2ccccc2n1)c1ccccc1
: