Target
Oxytocin receptor
Ligand
BDBM50342035
Substrate
Meas. Tech.
ChEMBL_743722 (CHEMBL1767536)
Ki
963±n/a nM
Citation
 Corbani, MTrueba, MStoev, SMurat, BMion, JBoulay, VGuillon, GManning, M Design, synthesis, and pharmacological characterization of fluorescent peptides for imaging human V1b vasopressin or oxytocin receptors. J Med Chem 54:2864-77 (2011)  
Target
Name:
Oxytocin receptor
Synonyms:
OT-R OXYR_HUMAN | Oxytocin
Type:
Enzyme Catalytic Domain
Mol. Mass.:
42793.26
Organism:
Homo sapiens (Human)
Description:
Oxytocin OXTR HEK293::B2R9L7
Residue:
389
  
Inhibitor
Name:
BDBM50342035
Synonyms:
CHEMBL1765670 | triethylamine hemi(2-((2S)-2-((2S)-1-((4R,7S,10S,13S,16S)-7-(2-amino-2-oxoethyl)-13-benzyl-19-hydroxy-16-(4-hydroxybenzyl)-10-isobutyl-6,9,12,15,18-pentaoxo-1,2-dithia-5,8,11,14,17-pentaazacycloicosane-4-carbonyl)pyrrolidine-2-carboxamido)-6-(2-(6-amino-3-imino-4,5-disulfonato-3H-xanthen-9-yl)-5-((2,3,5,6-tetrafluorophenoxy)carbonyl)benzamido)hexanamido)acetate)
Type:
Small organic molecule
Emp. Form.:
C68H76N12O23S4
Mol. Mass.:
1557.659
SMILES:
CC(C)C[C@@H]1NC(=O)[C@H](Cc2ccccc2)NC(=O)[C@H](Cc2ccc(O)cc2)NC(=O)C(O)CSSC[C@H](NC(=O)[C@H](CC(N)=O)NC1=O)C(=O)N1CCC[C@H]1C(=O)N[C@@H](CCCCNC(=O)c1ccc(c(c1)C([O-])=O)-c1c2ccc(N)c(c2oc2c(c(=[NH2+])ccc12)S([O-])(=O)=O)S([O-])(=O)=O)C(=O)NCC(O)=O
: