Target
Acetylcholinesterase
Ligand
BDBM50342853
Substrate
Meas. Tech.
ChEMBL_745145 (CHEMBL1772324)
Ki
21±n/a nM
Citation
 Conejo-García, APisani, LNúñez, Mdel CCatto, MNicolotti, OLeonetti, FCampos, JMGallo, MAEspinosa, ACarotti, A Homodimeric bis-quaternary heterocyclic ammonium salts as potent acetyl- and butyrylcholinesterase inhibitors: a systematic investigation of the influence of linker and cationic heads over affinity and selectivity. J Med Chem 54:2627-45 (2011)  
Target
Name:
Acetylcholinesterase
Synonyms:
ACES_BOVIN Acetylcholinesterase (AChE) | Acetylcholinesterase precursor
Type:
Enzyme
Mol. Mass.:
67659.62
Organism:
Bos taurus (bovine)
Description:
Residue:
613
  
Inhibitor
Name:
BDBM50342853
Synonyms:
4-(6,7-Dimethoxy-3,4-dihydroisoquinolin-2(1H)-yl)-1-{4-[(4-piperidin-1-ylpyridinium-1-yl)methyl]benzyl}pyridiniumbromide | CHEMBL1771556
Type:
Small organic molecule
Emp. Form.:
C34H40N4O2
Mol. Mass.:
536.7059
SMILES:
COc1cc2CC[N+](Cc2cc1OC)=c1ccn(Cc2ccc(Cn3ccc(cc3)=[N+]3CCCCC3)cc2)cc1
: