Target
Albumin
Ligand
BDBM50249522
Substrate
Meas. Tech.
ChEMBL_746842 (CHEMBL1777125)
Kd
1.3E5±n/a nM
Citation
 Giannetti, AMWong, HDijkgraaf, GJDueber, ECOrtwine, DFBravo, BJGould, SEPlise, EGLum, BLMalhi, VGraham, RA Identification, characterization, and implications of species-dependent plasma protein binding for the oral Hedgehog pathway inhibitor vismodegib (GDC-0449). J Med Chem 54:2592-601 (2011)  
Target
Name:
Albumin
Synonyms:
ALB Serum albumin
Type:
PROTEIN
Mol. Mass.:
69362.94
Organism:
Homo sapiens (Human)
Description:
ChEMBL_1509401
Residue:
609
  
Inhibitor
Name:
BDBM50249522
Synonyms:
2-chloro-N-(4-chloro-3-(pyridin-2-yl)phenyl)-4-(methylsulfonyl)benzamide VISMODEGIB
Type:
Small organic molecule
Emp. Form.:
C19H14Cl2N2O3S
Mol. Mass.:
421.297
SMILES:
CS(=O)(=O)c1ccc(C(=O)Nc2ccc(Cl)c(c2)-c2ccccn2)c(Cl)c1
: