Target
Histamine H4 receptor
Ligand
BDBM27213
Substrate
Meas. Tech.
ChEMBL_747322 (CHEMBL1776625)
Ki
612±n/a nM
Citation
 Wiecek, MKottke, TLigneau, XSchunack, WSeifert, RStark, HHandzlik, JKiec-Kononowicz, K N-Alkenyl and cycloalkyl carbamates as dual acting histamine H3 and H4 receptor ligands. Bioorg Med Chem 19:2850-8 (2011)  
Target
Name:
Histamine H4 receptor
Synonyms:
AXOR35 GPCR105 HH4R HRH4 Histamine H4 receptor Histamine receptor (H3 and H4) SP9144
Type:
G Protein-Coupled Receptor (GPCR)
Mol. Mass.:
44517.02
Organism:
Homo sapiens (Human)
Description:
Binding assays were using CHO cells stably expressing hH4R receptors.
Residue:
390
  
Inhibitor
Name:
BDBM27213
Synonyms:
4-[3-(4-cyclopropanecarbonylphenoxy)propyl]-1H-imidazole CHEMBL1795025 | Ciproxifan
Type:
Small organic molecule
Emp. Form.:
C16H18N2O2
Mol. Mass.:
270.3263
SMILES:
O=C(C1CC1)c1ccc(OCCCc2cnc[nH]2)cc1
: