Target
Cystic fibrosis transmembrane conductance regulator
Ligand
BDBM50343996
Substrate
Meas. Tech.
ChEMBL_748468 (CHEMBL1780321)
IC50
5±n/a nM
Citation
 Renard, BLBoucherle, BMaurin, BMolina, MCNorez, CBecq, FDécout, JL An expeditious access to 5-pyrimidinol derivatives from cyclic methylglyoxal diadducts, formation of argpyrimidines under physiological conditions and discovery of new CFTR inhibitors. Eur J Med Chem 46:1935-41 (2011)  
Target
Name:
Cystic fibrosis transmembrane conductance regulator
Synonyms:
ABCC7 CFTR Channel conductance-controlling ATPase | cAMP-dependent chloride channel
Type:
Enzyme Catalytic Domain
Mol. Mass.:
168171.30
Organism:
Homo sapiens (Human)
Description:
gi_90421313
Residue:
1480
  
Inhibitor
Name:
BDBM50343996
Synonyms:
2,4-dimethylpyrido[1,2-a]pyrimidin-5-ium-3-olate | CHEMBL1779949
Type:
Small organic molecule
Emp. Form.:
C10H10N2O
Mol. Mass.:
174.1992
SMILES:
Cc1nc2cccc[n+]2c(C)c1[O-]
: