Target
Free fatty acid receptor 1
Ligand
BDBM50344086
Substrate
Meas. Tech.
ChEMBL_748546 (CHEMBL1780399)
EC50
130±n/a nM
Citation
 Walsh, SPSeverino, AZhou, CHe, JLiang, GBTan, CPCao, JEiermann, GJXu, LSalituro, GHoward, ADMills, SGYang, L 3-Substituted 3-(4-aryloxyaryl)-propanoic acids as GPR40 agonists. Bioorg Med Chem Lett 21:3390-4 (2011)  
Target
Name:
Free fatty acid receptor 1
Synonyms:
FFAR1 G-protein Coupled Receptor 40 | GPR40
Type:
G Protein-Coupled Receptor (GPCR)
Mol. Mass.:
31473.32
Organism:
Homo sapiens (Human)
Description:
O14842
Residue:
300
  
Inhibitor
Name:
BDBM50344086
Synonyms:
CHEMBL1777878 | cis-rac-5-(1-(4-(2-(difluoromethoxy)-4-(trifluoromethyl)phenoxy)phenyl)but-2-ynyl)oxazolidine-2,4-dione
Type:
Small organic molecule
Emp. Form.:
C21H14F5NO5
Mol. Mass.:
455.3316
SMILES:
CC#C[C@H](c1oc(=O)[nH]c1O)c1ccc(Oc2ccc(cc2OC(F)F)C(F)(F)F)cc1
: