Target
Free fatty acid receptor 1
Ligand
BDBM50344076
Substrate
Meas. Tech.
ChEMBL_748591 (CHEMBL1780444)
IC50
342±n/a nM
Citation
 Walsh, SPSeverino, AZhou, CHe, JLiang, GBTan, CPCao, JEiermann, GJXu, LSalituro, GHoward, ADMills, SGYang, L 3-Substituted 3-(4-aryloxyaryl)-propanoic acids as GPR40 agonists. Bioorg Med Chem Lett 21:3390-4 (2011)  
Target
Name:
Free fatty acid receptor 1
Synonyms:
FFAR1 G-protein Coupled Receptor 40 | GPR40
Type:
G Protein-Coupled Receptor (GPCR)
Mol. Mass.:
31473.32
Organism:
Homo sapiens (Human)
Description:
O14842
Residue:
300
  
Inhibitor
Name:
BDBM50344076
Synonyms:
CHEMBL1777869 | rac-3-(4-(isoquinolin-1-yloxy)phenyl)hex-4-ynoic acid
Type:
Small organic molecule
Emp. Form.:
C21H17NO3
Mol. Mass.:
331.3646
SMILES:
CC#CC(CC(O)=O)c1ccc(Oc2nccc3ccccc23)cc1
: