Target
Cytochrome P450 3A4
Ligand
BDBM50344080
Substrate
Meas. Tech.
ChEMBL_748604 (CHEMBL1780457)
IC50
>50000±n/a nM
Citation
 Walsh, SPSeverino, AZhou, CHe, JLiang, GBTan, CPCao, JEiermann, GJXu, LSalituro, GHoward, ADMills, SGYang, L 3-Substituted 3-(4-aryloxyaryl)-propanoic acids as GPR40 agonists. Bioorg Med Chem Lett 21:3390-4 (2011)  
Target
Name:
Cytochrome P450 3A4
Synonyms:
Albendazole monooxygenase CP3A4_HUMAN CYP3A4 CYPIIIA4 Cytochrome P450 3A4 (CYP3A4) Nifedipine oxidase Taurochenodeoxycholate 6-alpha-hydroxylase
Type:
Enzyme
Mol. Mass.:
57349.57
Organism:
Homo sapiens (Human)
Description:
Residue:
503
  
Inhibitor
Name:
BDBM50344080
Synonyms:
CHEMBL1777855 | rac-3-(4-(2-(difluoromethoxy)-4-(trifluoromethyl)phenoxy)-2-fluorophenyl)hex-4-ynoic acid
Type:
Small organic molecule
Emp. Form.:
C20H14F6O4
Mol. Mass.:
432.3132
SMILES:
CC#CC(CC(O)=O)c1ccc(Oc2ccc(cc2OC(F)F)C(F)(F)F)cc1F
: