Target
B1 bradykinin receptor
Ligand
BDBM50272453
Substrate
Meas. Tech.
ChEMBL_748611 (CHEMBL1780464)
Ki
0.1±n/a nM
Citation
 Chen, JJNguyen, TD'Amico, DCQian, WHuman, JAya, TBiswas, KFotsch, CHan, NLiu, QNishimura, NPeterkin, TAYang, KZhu, JRiahi, BBHungate, RWAndersen, NGColyer, JTFaul, MMKamassah, AWang, JJona, JKumar, GJohnson, EAskew, BC 3-Oxo-2-piperazinyl acetamides as potent bradykinin B1 receptor antagonists for the treatment of pain and inflammation. Bioorg Med Chem Lett 21:3384-9 (2011)  
Target
Name:
B1 bradykinin receptor
Synonyms:
B1 BRADYKININ B1R BK-1 receptor BRADYB1 | Bradykinin B1 receptor
Type:
Enzyme
Mol. Mass.:
40508.87
Organism:
Homo sapiens (Human)
Description:
P46663
Residue:
353
  
Inhibitor
Name:
BDBM50272453
Synonyms:
2-((R)-1-(3,4-dichlorophenylsulfonyl)-3-oxo-1,2,3,4-tetrahydroquinoxalin-2-yl)-N-((R)-6-(piperidin-1-ylmethyl)-1,2,3,4-tetrahydronaphthalen-1-yl)acetamide | CHEMBL504531
Type:
Small organic molecule
Emp. Form.:
C32H34Cl2N4O4S
Mol. Mass.:
641.608
SMILES:
Clc1ccc(cc1Cl)S(=O)(=O)N1[C@H](CC(=O)N[C@@H]2CCCc3cc(CN4CCCCC4)ccc23)C(=O)Nc2ccccc12
: