Target
B1 bradykinin receptor
Ligand
BDBM50344098
Substrate
Meas. Tech.
ChEMBL_748609 (CHEMBL1780462)
IC50
0.33±n/a nM
Citation
 Chen, JJNguyen, TD'Amico, DCQian, WHuman, JAya, TBiswas, KFotsch, CHan, NLiu, QNishimura, NPeterkin, TAYang, KZhu, JRiahi, BBHungate, RWAndersen, NGColyer, JTFaul, MMKamassah, AWang, JJona, JKumar, GJohnson, EAskew, BC 3-Oxo-2-piperazinyl acetamides as potent bradykinin B1 receptor antagonists for the treatment of pain and inflammation. Bioorg Med Chem Lett 21:3384-9 (2011)  
Target
Name:
B1 bradykinin receptor
Synonyms:
B1 BRADYKININ B1R BK-1 receptor BRADYB1 | Bradykinin B1 receptor
Type:
Enzyme
Mol. Mass.:
40508.87
Organism:
Homo sapiens (Human)
Description:
P46663
Residue:
353
  
Inhibitor
Name:
BDBM50344098
Synonyms:
2-(1-(3-bromo-5-chlorothiophen-2-ylsulfonyl)-3-oxopiperazin-2-yl)-N-((R)-6-(piperidin-1-ylmethyl)-1,2,3,4-tetrahydronaphthalen-1-yl)acetamide | CHEMBL1777956
Type:
Small organic molecule
Emp. Form.:
C26H32BrClN4O4S2
Mol. Mass.:
644.044
SMILES:
Clc1cc(Br)c(s1)S(=O)(=O)N1CCNC(=O)C1CC(=O)N[C@@H]1CCCc2cc(CN3CCCCC3)ccc12
: