Target
Carbonic anhydrase 7
Ligand
BDBM50345212
Substrate
Meas. Tech.
ChEMBL_751966 (CHEMBL1785908)
Ki
53±n/a nM
Citation
 Hen, NBialer, MYagen, BMaresca, AAggarwal, MRobbins, AHMcKenna, RScozzafava, ASupuran, CT Anticonvulsant 4-aminobenzenesulfonamide derivatives with branched-alkylamide moieties: X-ray crystallography and inhibition studies of human carbonic anhydrase isoforms I, II, VII, and XIV. J Med Chem 54:3977-81 (2011)  
Target
Name:
Carbonic anhydrase 7
Synonyms:
CA-VII CAH7_HUMAN Carbonic anhydrase Carbonic anhydrase VII (CA VII)
Type:
Enzyme
Mol. Mass.:
29664.11
Organism:
Homo sapiens (Human)
Description:
Human cloned isozyme.
Residue:
264
  
Inhibitor
Name:
BDBM50345212
Synonyms:
2-isopropyl-3-methyl-N-(4-sulfamoylphenyl)pentanamide | CHEMBL1083382
Type:
Small organic molecule
Emp. Form.:
C15H24N2O3S
Mol. Mass.:
312.428
SMILES:
CCC(C)C(C(C)C)C(=O)Nc1ccc(cc1)S(N)(=O)=O
: