Target
Carbonic anhydrase 14
Ligand
BDBM50345222
Substrate
Meas. Tech.
ChEMBL_751967 (CHEMBL1785909)
Ki
6.5±n/a nM
Citation
 Hen, NBialer, MYagen, BMaresca, AAggarwal, MRobbins, AHMcKenna, RScozzafava, ASupuran, CT Anticonvulsant 4-aminobenzenesulfonamide derivatives with branched-alkylamide moieties: X-ray crystallography and inhibition studies of human carbonic anhydrase isoforms I, II, VII, and XIV. J Med Chem 54:3977-81 (2011)  
Target
Name:
Carbonic anhydrase 14
Synonyms:
CA-XIV CAH14_HUMAN Carbonic Anhydrase XIV Carbonic anhydrase 14 Carbonic anhydrase XIV (CA XIV)
Type:
Enzyme
Mol. Mass.:
37665.67
Organism:
Homo sapiens (Human)
Description:
Human (cloned) isozyme.
Residue:
337
  
Inhibitor
Name:
BDBM50345222
Synonyms:
2-ethyl-N-(4-sulfamoylphenyl)pentanamide | CHEMBL1084063
Type:
Small organic molecule
Emp. Form.:
C13H20N2O3S
Mol. Mass.:
284.374
SMILES:
CCCC(CC)C(=O)Nc1ccc(cc1)S(N)(=O)=O
: