Target
Serine/threonine-protein kinase pim-1
Ligand
BDBM50345256
Substrate
Meas. Tech.
ChEMBL_752073 (CHEMBL1786237)
IC50
220±n/a nM
Citation
 Xiang, YHirth, BAsmussen, GBiemann, HPBishop, KAGood, AFitzgerald, MGladysheva, TJain, AJancsics, KLiu, JMetz, MPapoulis, ASkerlj, RStepp, JDWei, RR The discovery of novel benzofuran-2-carboxylic acids as potent Pim-1 inhibitors. Bioorg Med Chem Lett 21:3050-6 (2011)  
Target
Name:
Serine/threonine-protein kinase pim-1
Synonyms:
PIM-1 Kinase PIM1_HUMAN Serine/threonine-protein kinase (PIM1) Serine/threonine-protein kinase PIM1 | Serine/threonine-protein kinase pim-1 (PIM1)
Type:
Protein
Mol. Mass.:
35681.82
Organism:
Homo sapiens (Human)
Description:
P11309
Residue:
313
  
Inhibitor
Name:
BDBM50345256
Synonyms:
5-bromo-7-(2-oxo-2-(piperazin-1-yl)ethoxy)benzofuran-2-carboxylic acid | CHEMBL1782527
Type:
Small organic molecule
Emp. Form.:
C15H15BrN2O5
Mol. Mass.:
383.194
SMILES:
OC(=O)c1cc2cc(Br)cc(OCC(=O)N3CCNCC3)c2o1
: