Target
Serine/threonine-protein kinase pim-2
Ligand
BDBM50345251
Substrate
Meas. Tech.
ChEMBL_752074 (CHEMBL1786238)
IC50
350±n/a nM
Citation
 Xiang, YHirth, BAsmussen, GBiemann, HPBishop, KAGood, AFitzgerald, MGladysheva, TJain, AJancsics, KLiu, JMetz, MPapoulis, ASkerlj, RStepp, JDWei, RR The discovery of novel benzofuran-2-carboxylic acids as potent Pim-1 inhibitors. Bioorg Med Chem Lett 21:3050-6 (2011)  
Target
Name:
Serine/threonine-protein kinase pim-2
Synonyms:
PIM2 Pim-2h Serine/threonine-protein kinase PIM | Serine/threonine-protein kinase pim-2 (PIM2)
Type:
Serine/threonine-protein kinase
Mol. Mass.:
34185.93
Organism:
Homo sapiens (Human)
Description:
Q9P1W9
Residue:
311
  
Inhibitor
Name:
BDBM50345251
Synonyms:
5-bromo-7-(2-(piperidin-4-yl)ethoxy)benzofuran-2-carboxylic acid | CHEMBL1782522
Type:
Small organic molecule
Emp. Form.:
C16H18BrNO4
Mol. Mass.:
368.222
SMILES:
OC(=O)c1cc2cc(Br)cc(OCCC3CCNCC3)c2o1
: