Target
Serine/threonine-protein kinase pim-2
Ligand
BDBM50345259
Substrate
Meas. Tech.
ChEMBL_752074 (CHEMBL1786238)
IC50
4±n/a nM
Citation
 Xiang, YHirth, BAsmussen, GBiemann, HPBishop, KAGood, AFitzgerald, MGladysheva, TJain, AJancsics, KLiu, JMetz, MPapoulis, ASkerlj, RStepp, JDWei, RR The discovery of novel benzofuran-2-carboxylic acids as potent Pim-1 inhibitors. Bioorg Med Chem Lett 21:3050-6 (2011)  
Target
Name:
Serine/threonine-protein kinase pim-2
Synonyms:
PIM2 Pim-2h Serine/threonine-protein kinase PIM | Serine/threonine-protein kinase pim-2 (PIM2)
Type:
Serine/threonine-protein kinase
Mol. Mass.:
34185.93
Organism:
Homo sapiens (Human)
Description:
Q9P1W9
Residue:
311
  
Inhibitor
Name:
BDBM50345259
Synonyms:
CHEMBL1782530 | cis-7-(4-aminocyclohexylamino)-5-bromobenzofuran-2-carboxylic acid
Type:
Small organic molecule
Emp. Form.:
C15H17BrN2O3
Mol. Mass.:
353.211
SMILES:
N[C@H]1CC[C@H](CC1)Nc1cc(Br)cc2cc(oc12)C(O)=O
: