Target
Metabotropic glutamate receptor 1
Ligand
BDBM50345955
Substrate
Meas. Tech.
ChEMBL_749914 (CHEMBL1786744)
Ki
2.2±n/a nM
Citation
 Sasikumar, TKQiang, LBurnett, DAGreenlee, WJLi, CHeimark, LPramanik, BGrilli, MBertorelli, RLozza, GReggiani, A Tricyclic thienopyridine-pyrimidones/thienopyrimidine-pyrimidones as orally efficacious mGluR1 antagonists for neuropathic pain. Bioorg Med Chem Lett 19:3199-203 (2009)  
Target
Name:
Metabotropic glutamate receptor 1
Synonyms:
GRM1_RAT Grm1 Metabotropic glutamate receptor Mglur1 metabotropic glutamate 1/5-D metabotropic glutamate receptor 1 isoform alpha precursor
Type:
Enzyme Catalytic Domain
Mol. Mass.:
133240.47
Organism:
RAT
Description:
metabotropic glutamate 1/2 0 RAT::P23385
Residue:
1199
  
Inhibitor
Name:
BDBM50345955
Synonyms:
3-(4-Chloro-phenyl)-9-(2-methyl-allylamino)-3H-thieno[2,3-d:4,5-d']dipyrimidin-4-one | CHEMBL1784054
Type:
Small organic molecule
Emp. Form.:
C18H14ClN5OS
Mol. Mass.:
383.855
SMILES:
CC(=C)CNc1ncnc2sc3c(ncn(-c4ccc(Cl)cc4)c3=O)c12
: